Reaction Details
TargetEstrogen receptor
LigandBDBM50310405
Substrate/Competitorn/a
Meas. Tech.ChEMBL_622101 (CHEMBL1114100)
IC50 8.7±n/a nM
Citation Jain, NXu, JKanojia, RMDu, FJian-Zhong, GPacia, ELai, MTMusto, AAllan, GReuman, MLi, XHahn, DCousineau, MPeng, SRitchie, DRussell, RLundeen, SSui, Z Identification and structure-activity relationships of chromene-derived selective estrogen receptor modulators for treatment of postmenopausal symptoms. J Med Chem52:7544-69 (2009) 
 
Estrogen receptor
Name:Estrogen receptor
Type:Protein
Mol. Mass.:66230.44
Organism:Homo sapiens (Human)
Description:P03372
Residue:595
BDBM50310405
NameBDBM50310405
Synonyms:(R)-5-{4-[2-(4-Methyl-piperazin-1-yl)-ethoxy]-phenyl}-11,12-dihydro-5H-6,13-dioxa-benzo[3,4]cyclohepta[1,2-a]naphthalene-2,8-diol | CHEMBL1084922
TypeSmall organic molecule
Emp. Form.C30H32N2O5
Mol. Mass.500.5855
SMILESCN1CCN(CCOc2ccc(cc2)[C@H]2Oc3cc(O)ccc3C3=C2c2ccc(O)cc2OCC3)CC1