Reaction Details
TargetGlycogen synthase kinase-3 beta
LigandBDBM50310454
Substrate/Competitorn/a
Meas. Tech.ChEMBL_619400 (CHEMBL1104158)
Ki 1500±n/a nM
Citation Bandarage, UHare, BParsons, JPham, LMarhefka, CBemis, GTang, QMoody, CSRodems, SShah, SAdams, CBravo, JCharonnet, ESavic, VCome, JHGreen, J 4-(Benzimidazol-2-yl)-1,2,5-oxadiazol-3-ylamine derivatives: potent and selective p70S6 kinase inhibitors. Bioorg Med Chem Lett19:5191-4 (2009) 
 
Glycogen synthase kinase-3 beta
Name:Glycogen synthase kinase-3 beta
Type:Enzyme
Mol. Mass.:46756.38
Organism:Homo sapiens (Human)
Description:P49841
Residue:420
BDBM50310454
NameBDBM50310454
Synonyms:4-(1-isopropyl-1H-benzo[d]imidazol-2-yl)-1,2,5-oxadiazol-3-amine | CHEMBL1079208
TypeSmall organic molecule
Emp. Form.C12H13N5O
Mol. Mass.243.2645
SMILESCC(C)n1c(nc2ccccc12)-c1nonc1N