Reaction Details
TargetRho-associated protein kinase 1
LigandBDBM50310454
Substrate/Competitorn/a
Meas. Tech.ChEMBL_619401 (CHEMBL1104159)
Ki 1900±n/a nM
Citation Bandarage, UHare, BParsons, JPham, LMarhefka, CBemis, GTang, QMoody, CSRodems, SShah, SAdams, CBravo, JCharonnet, ESavic, VCome, JHGreen, J 4-(Benzimidazol-2-yl)-1,2,5-oxadiazol-3-ylamine derivatives: potent and selective p70S6 kinase inhibitors. Bioorg Med Chem Lett19:5191-4 (2009) 
 
Rho-associated protein kinase 1
Name:Rho-associated protein kinase 1
Type:Serine/threonine-protein kinase
Mol. Mass.:158156.77
Organism:Homo sapiens (Human)
Description:Q13464
Residue:1354
BDBM50310454
NameBDBM50310454
Synonyms:4-(1-isopropyl-1H-benzo[d]imidazol-2-yl)-1,2,5-oxadiazol-3-amine | CHEMBL1079208
TypeSmall organic molecule
Emp. Form.C12H13N5O
Mol. Mass.243.2645
SMILESCC(C)n1c(nc2ccccc12)-c1nonc1N