Reaction Details
TargetcAMP-dependent protein kinase catalytic subunit alpha
LigandBDBM50310456
Substrate/Competitorn/a
Meas. Tech.ChEMBL_619399 (CHEMBL1104157)
Ki 540±n/a nM
Citation Bandarage, UHare, BParsons, JPham, LMarhefka, CBemis, GTang, QMoody, CSRodems, SShah, SAdams, CBravo, JCharonnet, ESavic, VCome, JHGreen, J 4-(Benzimidazol-2-yl)-1,2,5-oxadiazol-3-ylamine derivatives: potent and selective p70S6 kinase inhibitors. Bioorg Med Chem Lett19:5191-4 (2009) 
 
cAMP-dependent protein kinase catalytic subunit alpha
Name:cAMP-dependent protein kinase catalytic subunit alpha
Type:Enzyme Catalytic Subunit
Mol. Mass.:40598.73
Organism:Homo sapiens (Human)
Description:n/a
Residue:351
BDBM50310456
NameBDBM50310456
Synonyms:4-(1-cyclobutyl-1H-benzo[d]imidazol-2-yl)-1,2,5-oxadiazol-3-amine | CHEMBL1079294
TypeSmall organic molecule
Emp. Form.C13H13N5O
Mol. Mass.255.2752
SMILESNc1nonc1-c1nc2ccccc2n1C1CCC1