Reaction Details
TargetGlycogen synthase kinase-3 beta
LigandBDBM50310464
Substrate/Competitorn/a
Meas. Tech.ChEMBL_619400 (CHEMBL1104158)
Ki>2500±n/a nM
Citation Bandarage, UHare, BParsons, JPham, LMarhefka, CBemis, GTang, QMoody, CSRodems, SShah, SAdams, CBravo, JCharonnet, ESavic, VCome, JHGreen, J 4-(Benzimidazol-2-yl)-1,2,5-oxadiazol-3-ylamine derivatives: potent and selective p70S6 kinase inhibitors. Bioorg Med Chem Lett19:5191-4 (2009) 
 
Glycogen synthase kinase-3 beta
Name:Glycogen synthase kinase-3 beta
Type:Enzyme
Mol. Mass.:46756.38
Organism:Homo sapiens (Human)
Description:P49841
Residue:420
BDBM50310464
NameBDBM50310464
Synonyms:3-(2-(4-amino-1,2,5-oxadiazol-3-yl)-1H-benzo[d]imidazol-1-yl)benzonitrile | CHEMBL1078537
TypeSmall organic molecule
Emp. Form.C16H10N6O
Mol. Mass.302.2902
SMILESNc1nonc1-c1nc2ccccc2n1-c1cccc(c1)C#N