Reaction Details
TargetGlycogen synthase kinase-3 beta
LigandBDBM50310468
Substrate/Competitorn/a
Meas. Tech.ChEMBL_619400 (CHEMBL1104158)
Ki>5000±n/a nM
Citation Bandarage, UHare, BParsons, JPham, LMarhefka, CBemis, GTang, QMoody, CSRodems, SShah, SAdams, CBravo, JCharonnet, ESavic, VCome, JHGreen, J 4-(Benzimidazol-2-yl)-1,2,5-oxadiazol-3-ylamine derivatives: potent and selective p70S6 kinase inhibitors. Bioorg Med Chem Lett19:5191-4 (2009) 
 
Glycogen synthase kinase-3 beta
Name:Glycogen synthase kinase-3 beta
Type:Enzyme
Mol. Mass.:46756.38
Organism:Homo sapiens (Human)
Description:P49841
Residue:420
BDBM50310468
NameBDBM50310468
Synonyms:4-(1-(4-methoxyphenyl)-1H-benzo[d]imidazol-2-yl)-1,2,5-oxadiazol-3-amine | CHEMBL1078245
TypeSmall organic molecule
Emp. Form.C16H13N5O2
Mol. Mass.307.3067
SMILESCOc1ccc(cc1)-n1c(nc2ccccc12)-c1nonc1N