Reaction Details
TargetRho-associated protein kinase 1
LigandBDBM50310473
Substrate/Competitorn/a
Meas. Tech.ChEMBL_619401 (CHEMBL1104159)
Ki>3300±n/a nM
Citation Bandarage, UHare, BParsons, JPham, LMarhefka, CBemis, GTang, QMoody, CSRodems, SShah, SAdams, CBravo, JCharonnet, ESavic, VCome, JHGreen, J 4-(Benzimidazol-2-yl)-1,2,5-oxadiazol-3-ylamine derivatives: potent and selective p70S6 kinase inhibitors. Bioorg Med Chem Lett19:5191-4 (2009) 
 
Rho-associated protein kinase 1
Name:Rho-associated protein kinase 1
Type:Serine/threonine-protein kinase
Mol. Mass.:158156.77
Organism:Homo sapiens (Human)
Description:Q13464
Residue:1354
BDBM50310473
NameBDBM50310473
Synonyms:CHEMBL1080245 | N-(2-(4-amino-1,2,5-oxadiazol-3-yl)-1-cyclobutyl-1H-benzo[d]imidazol-5-yl)acetamide
TypeSmall organic molecule
Emp. Form.C15H16N6O2
Mol. Mass.312.3265
SMILESCC(=O)Nc1ccc2n(C3CCC3)c(nc2c1)-c1nonc1N