Reaction Details
TargetcAMP-dependent protein kinase catalytic subunit alpha
LigandBDBM50310478
Substrate/Competitorn/a
Meas. Tech.ChEMBL_619399 (CHEMBL1104157)
Ki>3300±n/a nM
Citation Bandarage, UHare, BParsons, JPham, LMarhefka, CBemis, GTang, QMoody, CSRodems, SShah, SAdams, CBravo, JCharonnet, ESavic, VCome, JHGreen, J 4-(Benzimidazol-2-yl)-1,2,5-oxadiazol-3-ylamine derivatives: potent and selective p70S6 kinase inhibitors. Bioorg Med Chem Lett19:5191-4 (2009) 
 
cAMP-dependent protein kinase catalytic subunit alpha
Name:cAMP-dependent protein kinase catalytic subunit alpha
Type:Enzyme Catalytic Subunit
Mol. Mass.:40598.73
Organism:Homo sapiens (Human)
Description:n/a
Residue:351
BDBM50310478
NameBDBM50310478
Synonyms:2-(4-amino-1,2,5-oxadiazol-3-yl)-1-isobutyl-1H-imidazole-4-carbonitrile | CHEMBL1082061
TypeSmall organic molecule
Emp. Form.C10H12N6O
Mol. Mass.232.2419
SMILESCC(C)Cn1cc(nc1-c1nonc1N)C#N