Reaction Details
TargetC-X-C chemokine receptor type 3
LigandBDBM50310487
Substrate/Competitorn/a
Meas. Tech.ChEMBL_619413 (CHEMBL1104171)
IC50 15±n/a nM
Citation Liu, JFu, ZLi, ARJohnson, MZhu, LMarcus, ADanao, JSullivan, TTonn, GCollins, TMedina, J Optimization of a series of quinazolinone-derived antagonists of CXCR3. Bioorg Med Chem Lett19:5114-8 (2009) 
 
C-X-C chemokine receptor type 3
Name:C-X-C chemokine receptor type 3
Type:Enzyme Catalytic Domain
Mol. Mass.:40665.65
Organism:Homo sapiens (Human)
Description:n/a
Residue:368
BDBM50310487
NameBDBM50310487
Synonyms:(R)-N-(2-(ethylsulfonyl)ethyl)-2-(4-fluoro-3-(trifluoromethyl)phenyl)-N-(1-(4-oxo-3-(4-(2,2,2-trifluoroethoxy)phenyl)-3,4-dihydropyrido[2,3-d]pyrimidin-2-yl)ethyl)acetamide | CHEMBL1077831
TypeSmall organic molecule
Emp. Form.C30H27F7N4O5S
Mol. Mass.688.613
SMILESCCS(=O)(=O)CCN([C@H](C)c1nc2ncccc2c(=O)n1-c1ccc(OCC(F)(F)F)cc1)C(=O)Cc1ccc(F)c(c1)C(F)(F)F