Reaction Details
TargetC-X-C chemokine receptor type 3
LigandBDBM50310488
Substrate/Competitorn/a
Meas. Tech.ChEMBL_619410 (CHEMBL1104168)
IC50 4±n/a nM
Citation Liu, JFu, ZLi, ARJohnson, MZhu, LMarcus, ADanao, JSullivan, TTonn, GCollins, TMedina, J Optimization of a series of quinazolinone-derived antagonists of CXCR3. Bioorg Med Chem Lett19:5114-8 (2009) 
 
C-X-C chemokine receptor type 3
Name:C-X-C chemokine receptor type 3
Type:Enzyme Catalytic Domain
Mol. Mass.:40665.65
Organism:Homo sapiens (Human)
Description:n/a
Residue:368
BDBM50310488
NameBDBM50310488
Synonyms:(R)-3-((N-(1-(3-(4-ethoxyphenyl)-4-oxo-3,4-dihydropyrido[2,3-d]pyrimidin-2-yl)ethyl)-2-(4-(trifluoromethoxy)phenyl)acetamido)methyl)pyridine 1-oxide | CHEMBL1077832
TypeSmall organic molecule
Emp. Form.C32H28F3N5O5
Mol. Mass.619.5904
SMILESCCOc1ccc(cc1)-n1c(nc2ncccc2c1=O)[C@@H](C)N(Cc1ccc[n+]([O-])c1)C(=O)Cc1ccc(OC(F)(F)F)cc1