Reaction Details
TargetC-X-C chemokine receptor type 3
LigandBDBM50310487
Substrate/Competitorn/a
Meas. Tech.ChEMBL_619418 (CHEMBL1104176)
IC50 2±n/a nM
Citation Liu, JFu, ZLi, ARJohnson, MZhu, LMarcus, ADanao, JSullivan, TTonn, GCollins, TMedina, J Optimization of a series of quinazolinone-derived antagonists of CXCR3. Bioorg Med Chem Lett19:5114-8 (2009) 
 
C-X-C chemokine receptor type 3
Name:C-X-C chemokine receptor type 3
Synonyms:CXC chemokine receptor 3
Type:PROTEIN
Mol. Mass.:40607.57
Organism:Macaca mulatta
Description:ChEMBL_619418
Residue:368
BDBM50310487
NameBDBM50310487
TypeSmall organic molecule
Emp. Form.C30H27F7N4O5S
Mol. Mass.688.613
SMILESCCS(=O)(=O)CCN([C@H](C)c1nc2ncccc2c(=O)n1-c1ccc(OCC(F)(F)F)cc1)C(=O)Cc1ccc(F)c(c1)C(F)(F)F