Reaction Details
TargetVascular endothelial growth factor receptor 2
LigandBDBM50300691
Substrate/Competitorn/a
Meas. Tech.ChEMBL_620391 (CHEMBL1112286)
Kd>200±n/a nM
Citation Patel, HKGrotzfeld, RMLai, AGMehta, SAMilanov, ZVChao, QSprankle, KGCarter, TAVelasco, AMFabian, MAJames, JTreiber, DKLockhart, DJZarrinkar, PPBhagwat, SS Arylcarboxyamino-substituted diaryl ureas as potent and selective FLT3 inhibitors. Bioorg Med Chem Lett19:5182-5 (2009) 
 
Vascular endothelial growth factor receptor 2
Name:Vascular endothelial growth factor receptor 2
Type:Receptor Tyrosine Kinase
Mol. Mass.:151510.97
Organism:Homo sapiens (Human)
Description:P35968
Residue:1356
BDBM50300691
NameBDBM50300691
Synonyms:Benzo[d]imidazo[2,1-b]thiazole-2-carboxylic acid {4-[3-(5-tert-butyl-isoxazol-3-yl)-ureido]-phenyl}-amide CHEMBL575925
TypeSmall organic molecule
Emp. Form.C24H22N6O3S
Mol. Mass.474.535
SMILESCC(C)(C)c1cc(NC(=O)Nc2ccc(NC(=O)c3cn4c(n3)sc3ccccc43)cc2)no1