Reaction Details
TargetProto-oncogene tyrosine-protein kinase receptor Ret
LigandBDBM50310628
Substrate/Competitorn/a
Meas. Tech.ChEMBL_620394 (CHEMBL1112289)
Kd 7.3±n/a nM
Citation Patel, HKGrotzfeld, RMLai, AGMehta, SAMilanov, ZVChao, QSprankle, KGCarter, TAVelasco, AMFabian, MAJames, JTreiber, DKLockhart, DJZarrinkar, PPBhagwat, SS Arylcarboxyamino-substituted diaryl ureas as potent and selective FLT3 inhibitors. Bioorg Med Chem Lett19:5182-5 (2009) 
 
Proto-oncogene tyrosine-protein kinase receptor Ret
Name:Proto-oncogene tyrosine-protein kinase receptor Ret
Type:Protein
Mol. Mass.:124318.29
Organism:Homo sapiens (Human)
Description:P07949
Residue:1114
BDBM50310628
NameBDBM50310628
Synonyms:AB-460 N-(4-(3-(5-tert-butylisoxazol-3-yl)ureido)phenyl)isoquinoline-3-carboxamide
TypeSmall organic molecule
Emp. Form.C24H23N5O3
Mol. Mass.429.4711
SMILESCC(C)(C)c1cc(NC(=O)Nc2ccc(NC(=O)c3cc4ccccc4cn3)cc2)no1