Reaction Details
TargetBifunctional epoxide hydrolase 2
LigandBDBM50310793
Substrate/Competitorn/a
Meas. Tech.ChEMBL_621472 (CHEMBL1100033)
IC50 1.3±n/a nM
Citation Shen, HCDing, FXDeng, QXu, SChen, HSTong, XTong, VZhang, XChen, YZhou, GPai, LYAlonso-Galicia, MZhang, BRoy, STata, JRBerger, JPColletti, SL Discovery of 3,3-disubstituted piperidine-derived trisubstituted ureas as highly potent soluble epoxide hydrolase inhibitors. Bioorg Med Chem Lett19:5314-20 (2009) 
 
Bifunctional epoxide hydrolase 2
Name:Bifunctional epoxide hydrolase 2
Type:Enzyme
Mol. Mass.:62613.07
Organism:Homo sapiens (Human)
Description:P34913
Residue:555
BDBM50310793
NameBDBM50310793
Synonyms:CHEMBL1079291 | N-(4-chlorophenyl)-3-(3-hydroxypropyl)-3-phenylpiperidine-1-carboxamide
TypeSmall organic molecule
Emp. Form.C21H25ClN2O2
Mol. Mass.372.888
SMILESOCCCC1(CCCN(C1)C(=O)Nc1ccc(Cl)cc1)c1ccccc1