Reaction Details
Target72 kDa type IV collagenase
LigandBDBM50133496
Substrate/Competitorn/a
Meas. Tech.ChEMBL_622215 (CHEMBL1106839)
IC50 27200±n/a nM
Citation Murata, TSasaki, KSato, KYoshizaki, FYamada, HMutoh, HUmehara, KMiyase, TWarashina, TAoshima, HTabata, HMatsubara, K Matrix metalloproteinase-2 inhibitors from Clinopodium chinense var. parviflorum. J Nat Prod72:1379-84 (2009) 
 
72 kDa type IV collagenase
Name:72 kDa type IV collagenase
Type:n/a
Mol. Mass.:74137.51
Organism:Rattus norvegicus (Rat)
Description:P33436
Residue:662
BDBM50133496
NameBDBM50133496
Synonyms:(2R)-3-(3,4-dihydroxyphenyl)-2-[(2E)-3-(3,4-dihydroxyphenyl)prop-2-enoyloxy]propanoic acid CHEMBL324842 US10688093, Compound rosmarinic acid cid_5281792
TypeSmall organic molecule
Emp. Form.C18H16O8
Mol. Mass.360.3148
SMILESOC(=O)[C@@H](Cc1ccc(O)c(O)c1)OC(=O)\C=C\c1ccc(O)c(O)c1