Reaction Details
TargetProstaglandin E2 receptor EP3 subtype
LigandBDBM50311624
Substrate/Competitorn/a
Meas. Tech.ChEMBL_618650 (CHEMBL1101699)
IC50 1±n/a nM
Citation Hategan, GPolozov, AMZeller, WCao, HMishra, RKKiselyov, ASRamirez, JHalldorsdottir, GAndrésson, TGurney, MESingh, J Heterocyclic 1,7-disubstituted indole sulfonamides are potent and selective human EP3 receptor antagonists. Bioorg Med Chem Lett19:6797-800 (2009) 
 
Prostaglandin E2 receptor EP3 subtype
Name:Prostaglandin E2 receptor EP3 subtype
Type:Enzyme
Mol. Mass.:43335.03
Organism:Homo sapiens (Human)
Description:P43115
Residue:390
BDBM50311624
NameBDBM50311624
Synonyms:3,4-difluoro-N-(5-(5-fluoro-3-methyl-1-(naphthalen-2-ylmethyl)-1H-indol-7-yl)isoxazol-3-yl)benzenesulfonamide | CHEMBL1081187
TypeSmall organic molecule
Emp. Form.C29H20F3N3O3S
Mol. Mass.547.548
SMILESCc1cn(Cc2ccc3ccccc3c2)c2c(cc(F)cc12)-c1cc(NS(=O)(=O)c2ccc(F)c(F)c2)no1