Reaction Details
TargetRho-associated protein kinase 2
LigandBDBM50311719
Substrate/Competitorn/a
Meas. Tech.ChEMBL_618707 (CHEMBL1102485)
IC50 66±n/a nM
Citation Yin, YLin, LRuiz, CCameron, MDPocas, JGrant, WSchröter, TChen, WDuckett, DSchürer, SLograsso, PFeng, Y Benzothiazoles as Rho-associated kinase (ROCK-II) inhibitors. Bioorg Med Chem Lett19:6686-90 (2009) 
 
Rho-associated protein kinase 2
Name:Rho-associated protein kinase 2
Type:Protein
Mol. Mass.:160885.43
Organism:Homo sapiens (Human)
Description:O75116
Residue:1388
BDBM50311719
NameBDBM50311719
Synonyms:2-(2-(chroman-3-yl)-6-(1H-pyrazol-4-yl)benzo[d]thiazol-4-yloxy)-N,N-dimethylethanamine | CHEMBL1081899
TypeSmall organic molecule
Emp. Form.C23H24N4O2S
Mol. Mass.420.527
SMILESCN(C)CCOc1cc(cc2sc(nc12)C1COc2ccccc2C1)-c1cn[nH]c1