Reaction Details
TargetRho-associated protein kinase 2
LigandBDBM50311720
Substrate/Competitorn/a
Meas. Tech.ChEMBL_618707 (CHEMBL1102485)
IC50 51±n/a nM
Citation Yin, YLin, LRuiz, CCameron, MDPocas, JGrant, WSchröter, TChen, WDuckett, DSchürer, SLograsso, PFeng, Y Benzothiazoles as Rho-associated kinase (ROCK-II) inhibitors. Bioorg Med Chem Lett19:6686-90 (2009) 
 
Rho-associated protein kinase 2
Name:Rho-associated protein kinase 2
Type:Protein
Mol. Mass.:160885.43
Organism:Homo sapiens (Human)
Description:O75116
Residue:1388
BDBM50311720
NameBDBM50311720
Synonyms:CHEMBL1081182 | N1-(2-(chroman-3-yl)-6-(1H-pyrazol-4-yl)benzo[d]thiazol-4-yl)-N1,N2,N2-trimethylethane-1,2-diamine
TypeSmall organic molecule
Emp. Form.C24H27N5OS
Mol. Mass.433.569
SMILESCN(C)CCN(C)c1cc(cc2sc(nc12)C1COc2ccccc2C1)-c1cn[nH]c1