Reaction Details
TargetRho-associated protein kinase 2
LigandBDBM50311734
Substrate/Competitorn/a
Meas. Tech.ChEMBL_618707 (CHEMBL1102485)
IC50 93±n/a nM
Citation Yin, YLin, LRuiz, CCameron, MDPocas, JGrant, WSchröter, TChen, WDuckett, DSchürer, SLograsso, PFeng, Y Benzothiazoles as Rho-associated kinase (ROCK-II) inhibitors. Bioorg Med Chem Lett19:6686-90 (2009) 
 
Rho-associated protein kinase 2
Name:Rho-associated protein kinase 2
Type:Protein
Mol. Mass.:160885.43
Organism:Homo sapiens (Human)
Description:O75116
Residue:1388
BDBM50311734
NameBDBM50311734
Synonyms:2-(6-methylchroman-3-yl)-6-(1H-pyrazol-4-yl)benzo[d]thiazole | CHEMBL1081183
TypeSmall organic molecule
Emp. Form.C20H17N3OS
Mol. Mass.347.433
SMILESCc1ccc2OCC(Cc2c1)c1nc2ccc(cc2s1)-c1cn[nH]c1