Reaction Details
TargetRho-associated protein kinase 2
LigandBDBM50311714
Substrate/Competitorn/a
Meas. Tech.ChEMBL_618709 (CHEMBL1102487)
IC50 1500±n/a nM
Citation Yin, YLin, LRuiz, CCameron, MDPocas, JGrant, WSchröter, TChen, WDuckett, DSchürer, SLograsso, PFeng, Y Benzothiazoles as Rho-associated kinase (ROCK-II) inhibitors. Bioorg Med Chem Lett19:6686-90 (2009) 
 
Rho-associated protein kinase 2
Name:Rho-associated protein kinase 2
Type:Protein
Mol. Mass.:160885.43
Organism:Homo sapiens (Human)
Description:O75116
Residue:1388
BDBM50311714
NameBDBM50311714
Synonyms:4-(2-(chroman-3-yl)benzo[d]thiazol-6-yl)pyrimidin-2-amine | CHEMBL1079782
TypeSmall organic molecule
Emp. Form.C20H16N4OS
Mol. Mass.360.432
SMILESNc1nccc(n1)-c1ccc2nc(sc2c1)C1COc2ccccc2C1