Reaction Details
TargetRho-associated protein kinase 2
LigandBDBM50311713
Substrate/Competitorn/a
Meas. Tech.ChEMBL_618707 (CHEMBL1102485)
IC50 0.400000±n/a nM
Citation Yin, YLin, LRuiz, CCameron, MDPocas, JGrant, WSchröter, TChen, WDuckett, DSchürer, SLograsso, PFeng, Y Benzothiazoles as Rho-associated kinase (ROCK-II) inhibitors. Bioorg Med Chem Lett19:6686-90 (2009) 
 
Rho-associated protein kinase 2
Name:Rho-associated protein kinase 2
Type:Protein
Mol. Mass.:160885.43
Organism:Homo sapiens (Human)
Description:O75116
Residue:1388
BDBM50311713
NameBDBM50311713
Synonyms:CHEMBL1080279 SR-6494
TypeSmall organic molecule
Emp. Form.C23H25N5O2S
Mol. Mass.435.542
SMILESCOc1cccc(CN(CCN(C)C)C(=O)c2nc3ccc(cc3s2)-c2cn[nH]c2)c1