Reaction Details
TargetRho-associated protein kinase 2
LigandBDBM50311726
Substrate/Competitorn/a
Meas. Tech.ChEMBL_618709 (CHEMBL1102487)
IC50 455±n/a nM
Citation Yin, YLin, LRuiz, CCameron, MDPocas, JGrant, WSchröter, TChen, WDuckett, DSchürer, SLograsso, PFeng, Y Benzothiazoles as Rho-associated kinase (ROCK-II) inhibitors. Bioorg Med Chem Lett19:6686-90 (2009) 
 
Rho-associated protein kinase 2
Name:Rho-associated protein kinase 2
Type:Protein
Mol. Mass.:160885.43
Organism:Homo sapiens (Human)
Description:O75116
Residue:1388
BDBM50311726
NameBDBM50311726
Synonyms:CHEMBL1081196 | N-ethyl-N-(3-methoxybenzyl)-6-(1H-pyrazol-4-yl)benzo[d]thiazole-2-carboxamide
TypeSmall organic molecule
Emp. Form.C21H20N4O2S
Mol. Mass.392.474
SMILESCCN(Cc1cccc(OC)c1)C(=O)c1nc2ccc(cc2s1)-c1cn[nH]c1