Reaction Details
TargetRho-associated protein kinase 2
LigandBDBM50311725
Substrate/Competitorn/a
Meas. Tech.ChEMBL_618709 (CHEMBL1102487)
IC50>2700±n/a nM
Citation Yin, YLin, LRuiz, CCameron, MDPocas, JGrant, WSchröter, TChen, WDuckett, DSchürer, SLograsso, PFeng, Y Benzothiazoles as Rho-associated kinase (ROCK-II) inhibitors. Bioorg Med Chem Lett19:6686-90 (2009) 
 
Rho-associated protein kinase 2
Name:Rho-associated protein kinase 2
Type:Protein
Mol. Mass.:160885.43
Organism:Homo sapiens (Human)
Description:O75116
Residue:1388
BDBM50311725
NameBDBM50311725
Synonyms:CHEMBL1081193 | N-(3-methoxybenzyl)-6-(1H-pyrazol-4-yl)benzo[d]thiazole-2-carboxamide
TypeSmall organic molecule
Emp. Form.C19H16N4O2S
Mol. Mass.364.421
SMILESCOc1cccc(CNC(=O)c2nc3ccc(cc3s2)-c2cn[nH]c2)c1