Reaction Details
TargetRho-associated protein kinase 2
LigandBDBM50311727
Substrate/Competitorn/a
Meas. Tech.ChEMBL_618709 (CHEMBL1102487)
IC50 871±n/a nM
Citation Yin, YLin, LRuiz, CCameron, MDPocas, JGrant, WSchröter, TChen, WDuckett, DSchürer, SLograsso, PFeng, Y Benzothiazoles as Rho-associated kinase (ROCK-II) inhibitors. Bioorg Med Chem Lett19:6686-90 (2009) 
 
Rho-associated protein kinase 2
Name:Rho-associated protein kinase 2
Type:Protein
Mol. Mass.:160885.43
Organism:Homo sapiens (Human)
Description:O75116
Residue:1388
BDBM50311727
NameBDBM50311727
Synonyms:CHEMBL1081001 | N-(3-methoxybenzyl)-N-(2-methoxyethyl)-6-(1H-pyrazol-4-yl)benzo[d]thiazole-2-carboxamide
TypeSmall organic molecule
Emp. Form.C22H22N4O3S
Mol. Mass.422.5
SMILESCOCCN(Cc1cccc(OC)c1)C(=O)c1nc2ccc(cc2s1)-c1cn[nH]c1