Reaction Details
TargetMitogen-activated protein kinase 10
LigandBDBM50311728
Substrate/Competitorn/a
Meas. Tech.ChEMBL_618951 (CHEMBL1099849)
IC50 5456±n/a nM
Citation Yin, YLin, LRuiz, CCameron, MDPocas, JGrant, WSchröter, TChen, WDuckett, DSchürer, SLograsso, PFeng, Y Benzothiazoles as Rho-associated kinase (ROCK-II) inhibitors. Bioorg Med Chem Lett19:6686-90 (2009) 
 
Mitogen-activated protein kinase 10
Name:Mitogen-activated protein kinase 10
Type:Enzyme
Mol. Mass.:52586.89
Organism:Homo sapiens (Human)
Description:n/a
Residue:464
BDBM50311728
NameBDBM50311728
Synonyms:3-(6-(1H-pyrazol-4-yl)benzo[d]thiazol-2-yl)-N-(3-(dimethylamino)propyl)chroman-6-carboxamide SR-6074
TypeSmall organic molecule
Emp. Form.C25H27N5O2S
Mol. Mass.461.579
SMILESCN(C)CCCNC(=O)c1ccc2OCC(Cc2c1)c1nc2ccc(cc2s1)-c1cn[nH]c1