Reaction Details
TargetHistamine H4 receptor
LigandBDBM27213
Substrate/Competitorn/a
Meas. Tech.ChEMBL_619282 (CHEMBL1100662)
Ki 612±n/a nM
Citation Łazewska, DWiecek, MLigneau, XKottke, TWeizel, LSeifert, RSchunack, WStark, HKiec-Kononowicz, K Histamine H3 and H4 receptor affinity of branched 3-(1H-imidazol-4-yl)propyl N-alkylcarbamates. Bioorg Med Chem Lett19:6682-5 (2009) 
 
Histamine H4 receptor
Name:Histamine H4 receptor
Type:G Protein-Coupled Receptor (GPCR)
Mol. Mass.:44517.02
Organism:Homo sapiens (Human)
Description:Binding assays were using CHO cells stably expressing hH4R receptors.
Residue:390
BDBM27213
NameBDBM27213
Synonyms:4-[3-(4-cyclopropanecarbonylphenoxy)propyl]-1H-imidazole CHEMBL1795025 | Ciproxifan
TypeSmall organic molecule
Emp. Form.C16H18N2O2
Mol. Mass.270.3263
SMILESO=C(C1CC1)c1ccc(OCCCc2cnc[nH]2)cc1