Reaction Details
TargetAcetyl-CoA carboxylase 2
LigandBDBM50311816
Substrate/Competitorn/a
Meas. Tech.ChEMBL_619915 (CHEMBL1110305)
IC50 23±n/a nM
Citation Chonan, TOi, TYamamoto, DYashiro, MWakasugi, DTanaka, HOhoka-Sugita, AIo, FKoretsune, HHiratate, A (4-Piperidinyl)-piperazine: a new platform for acetyl-CoA carboxylase inhibitors. Bioorg Med Chem Lett19:6645-8 (2009) 
 
Acetyl-CoA carboxylase 2
Name:Acetyl-CoA carboxylase 2
Type:Protein
Mol. Mass.:276535.21
Organism:Homo sapiens (Human)
Description:O00763
Residue:2458
BDBM50311816
NameBDBM50311816
Synonyms:1-(4-(4-(4-(2,6-dip-tolylisonicotinoyl)piperazin-1-yl)piperidine-1-carbonyl)piperidin-1-yl)ethanone | CHEMBL1076223
TypeSmall organic molecule
Emp. Form.C37H45N5O3
Mol. Mass.607.7849
SMILESCC(=O)N1CCC(CC1)C(=O)N1CCC(CC1)N1CCN(CC1)C(=O)c1cc(nc(c1)-c1ccc(C)cc1)-c1ccc(C)cc1