Reaction Details
TargetProtein kinase C theta type
LigandBDBM50311950
Substrate/Competitorn/a
Meas. Tech.ChEMBL_619965 (CHEMBL1114007)
IC50 121±n/a nM
Citation Shim, JEid, CLee, JLiu, EChaudhary, DBoschelli, DH Synthesis and PKCtheta inhibitory activity of a series of 5-vinyl phenyl sulfonamide-3-pyridinecarbonitriles. Bioorg Med Chem Lett19:6575-7 (2009) 
 
Protein kinase C theta type
Name:Protein kinase C theta type
Type:Serine/threonine-protein kinase
Mol. Mass.:81878.04
Organism:Homo sapiens (Human)
Description:Full-length human PKC theta (Panvera Catalog No. P2996).
Residue:706
BDBM50311950
NameBDBM50311950
Synonyms:CHEMBL1081357 | N-sec-butyl-1-(4-(2-(5-cyano-4-(4-methyl-1H-indol-5-ylamino)pyridin-3-yl)vinyl)phenyl)methanesulfonamide
TypeSmall organic molecule
Emp. Form.C28H29N5O2S
Mol. Mass.499.627
SMILESCCC(C)NS(=O)(=O)Cc1ccc(\C=C\c2cncc(C#N)c2Nc2ccc3[nH]ccc3c2C)cc1