Reaction Details
TargetProtein kinase C delta type
LigandBDBM50311958
Substrate/Competitorn/a
Meas. Tech.ChEMBL_619964 (CHEMBL1114006)
IC50 7100±n/a nM
Citation Shim, JEid, CLee, JLiu, EChaudhary, DBoschelli, DH Synthesis and PKCtheta inhibitory activity of a series of 5-vinyl phenyl sulfonamide-3-pyridinecarbonitriles. Bioorg Med Chem Lett19:6575-7 (2009) 
 
Protein kinase C delta type
Name:Protein kinase C delta type
Type:Enzyme
Mol. Mass.:77516.79
Organism:Homo sapiens (Human)
Description:The recombinant human PKC enzymes were produced using a baculovirus expression system in SF9 cells
Residue:676
BDBM50311958
NameBDBM50311958
Synonyms:6-methyl-4-(4-methyl-1H-indol-5-ylamino)-5-(4-(pyrrolidin-1-ylsulfonyl)styryl)nicotinonitrile | CHEMBL1079745
TypeSmall organic molecule
Emp. Form.C28H27N5O2S
Mol. Mass.497.611
SMILESCc1ncc(C#N)c(Nc2ccc3[nH]ccc3c2C)c1\C=C\c1ccc(cc1)S(=O)(=O)N1CCCC1