Reaction Details
TargetProtein kinase C delta type
LigandBDBM50311963
Substrate/Competitorn/a
Meas. Tech.ChEMBL_619964 (CHEMBL1114006)
IC50 97±n/a nM
Citation Shim, JEid, CLee, JLiu, EChaudhary, DBoschelli, DH Synthesis and PKCtheta inhibitory activity of a series of 5-vinyl phenyl sulfonamide-3-pyridinecarbonitriles. Bioorg Med Chem Lett19:6575-7 (2009) 
 
Protein kinase C delta type
Name:Protein kinase C delta type
Type:Enzyme
Mol. Mass.:77516.79
Organism:Homo sapiens (Human)
Description:The recombinant human PKC enzymes were produced using a baculovirus expression system in SF9 cells
Residue:676
BDBM50311963
NameBDBM50311963
Synonyms:6-methyl-4-(4-methyl-1H-indol-5-ylamino)-5-(3-((4-methylpiperazin-1-ylsulfonyl)methyl)styryl)nicotinonitrile | CHEMBL1079427
TypeSmall organic molecule
Emp. Form.C30H32N6O2S
Mol. Mass.540.679
SMILESCN1CCN(CC1)S(=O)(=O)Cc1cccc(\C=C\c2c(C)ncc(C#N)c2Nc2ccc3[nH]ccc3c2C)c1