Reaction Details
TargetProtein kinase C epsilon type
LigandBDBM50311953
Substrate/Competitorn/a
Meas. Tech.ChEMBL_619962 (CHEMBL1114004)
IC50 1.6±n/a nM
Citation Shim, JEid, CLee, JLiu, EChaudhary, DBoschelli, DH Synthesis and PKCtheta inhibitory activity of a series of 5-vinyl phenyl sulfonamide-3-pyridinecarbonitriles. Bioorg Med Chem Lett19:6575-7 (2009) 
 
Protein kinase C epsilon type
Name:Protein kinase C epsilon type
Type:Enzyme
Mol. Mass.:83680.45
Organism:Homo sapiens (Human)
Description:The recombinant human PKC enzymes were produced using a baculovirus expression system in SF9 cells
Residue:737
BDBM50311953
NameBDBM50311953
Synonyms:4-(4-methyl-1H-indol-5-ylamino)-5-(3-(4-methylpiperazin-1-ylsulfonyl)styryl)nicotinonitrile | CHEMBL1080994
TypeSmall organic molecule
Emp. Form.C28H28N6O2S
Mol. Mass.512.626
SMILESCN1CCN(CC1)S(=O)(=O)c1cccc(\C=C\c2cncc(C#N)c2Nc2ccc3[nH]ccc3c2C)c1