Reaction Details
TargetTyrosine-protein kinase Lyn
LigandBDBM50311954
Substrate/Competitorn/a
Meas. Tech.ChEMBL_619956 (CHEMBL1113998)
IC50>50000±n/a nM
Citation Shim, JEid, CLee, JLiu, EChaudhary, DBoschelli, DH Synthesis and PKCtheta inhibitory activity of a series of 5-vinyl phenyl sulfonamide-3-pyridinecarbonitriles. Bioorg Med Chem Lett19:6575-7 (2009) 
 
Tyrosine-protein kinase Lyn
Name:Tyrosine-protein kinase Lyn
Type:Protein
Mol. Mass.:58575.92
Organism:Homo sapiens (Human)
Description:P07948
Residue:512
BDBM50311954
NameBDBM50311954
Synonyms:6-methyl-4-(4-methyl-1H-indol-5-ylamino)-5-(3-(4-methylpiperazin-1-ylsulfonyl)styryl)nicotinonitrile | CHEMBL1080995
TypeSmall organic molecule
Emp. Form.C29H30N6O2S
Mol. Mass.526.653
SMILESCN1CCN(CC1)S(=O)(=O)c1cccc(\C=C\c2c(C)ncc(C#N)c2Nc2ccc3[nH]ccc3c2C)c1