Reaction Details
TargetProto-oncogene tyrosine-protein kinase Src
LigandBDBM50311953
Substrate/Competitorn/a
Meas. Tech.ChEMBL_619955 (CHEMBL1113997)
IC50 220±n/a nM
Citation Shim, JEid, CLee, JLiu, EChaudhary, DBoschelli, DH Synthesis and PKCtheta inhibitory activity of a series of 5-vinyl phenyl sulfonamide-3-pyridinecarbonitriles. Bioorg Med Chem Lett19:6575-7 (2009) 
 
Proto-oncogene tyrosine-protein kinase Src
Name:Proto-oncogene tyrosine-protein kinase Src
Type:Protein
Mol. Mass.:59838.60
Organism:Homo sapiens (Human)
Description:P12931
Residue:536
BDBM50311953
NameBDBM50311953
Synonyms:4-(4-methyl-1H-indol-5-ylamino)-5-(3-(4-methylpiperazin-1-ylsulfonyl)styryl)nicotinonitrile | CHEMBL1080994
TypeSmall organic molecule
Emp. Form.C28H28N6O2S
Mol. Mass.512.626
SMILESCN1CCN(CC1)S(=O)(=O)c1cccc(\C=C\c2cncc(C#N)c2Nc2ccc3[nH]ccc3c2C)c1