Reaction Details
TargetAngiopoietin-1 receptor
LigandBDBM50311968
Substrate/Competitorn/a
Meas. Tech.ChEMBL_620194 (CHEMBL1115829)
IC50 1400±n/a nM
Citation Luke, RWBallard, PButtar, DCampbell, LCurwen, JEmery, SCGriffen, AMHassall, LHayter, BRJones, CDMcCoull, WMellor, MSwain, MLTucker, JA Novel thienopyrimidine and thiazolopyrimidine kinase inhibitors with activity against Tie-2 in vitro and in vivo. Bioorg Med Chem Lett19:6670-4 (2009) 
 
Angiopoietin-1 receptor
Name:Angiopoietin-1 receptor
Type:Enzyme
Mol. Mass.:125835.70
Organism:Homo sapiens (Human)
Description:Q02763
Residue:1124
BDBM50311968
NameBDBM50311968
Synonyms:6-(1-methyl-4-(3-(p-tolylthio)phenyl)-1H-imidazol-5-yl)thieno[2,3-d]pyrimidin-4-amine | CHEMBL1079429
TypeSmall organic molecule
Emp. Form.C23H19N5S2
Mol. Mass.429.56
SMILESCc1ccc(Sc2cccc(c2)-c2ncn(C)c2-c2cc3c(N)ncnc3s2)cc1