Reaction Details
TargetAngiopoietin-1 receptor
LigandBDBM50311973
Substrate/Competitorn/a
Meas. Tech.ChEMBL_620194 (CHEMBL1115829)
IC50 3000±n/a nM
Citation Luke, RWBallard, PButtar, DCampbell, LCurwen, JEmery, SCGriffen, AMHassall, LHayter, BRJones, CDMcCoull, WMellor, MSwain, MLTucker, JA Novel thienopyrimidine and thiazolopyrimidine kinase inhibitors with activity against Tie-2 in vitro and in vivo. Bioorg Med Chem Lett19:6670-4 (2009) 
 
Angiopoietin-1 receptor
Name:Angiopoietin-1 receptor
Type:Enzyme
Mol. Mass.:125835.70
Organism:Homo sapiens (Human)
Description:Q02763
Residue:1124
BDBM50311973
NameBDBM50311973
Synonyms:2-(1-ethyl-4-phenyl-1H-imidazol-5-yl)thiazolo[5,4-d]pyrimidin-7-amine | CHEMBL1079588
TypeSmall organic molecule
Emp. Form.C16H14N6S
Mol. Mass.322.388
SMILESCCn1cnc(c1-c1nc2c(N)ncnc2s1)-c1ccccc1