Reaction Details
TargetAngiopoietin-1 receptor
LigandBDBM50311967
Substrate/Competitorn/a
Meas. Tech.ChEMBL_620201 (CHEMBL1115836)
IC50 34000±n/a nM
Citation Luke, RWBallard, PButtar, DCampbell, LCurwen, JEmery, SCGriffen, AMHassall, LHayter, BRJones, CDMcCoull, WMellor, MSwain, MLTucker, JA Novel thienopyrimidine and thiazolopyrimidine kinase inhibitors with activity against Tie-2 in vitro and in vivo. Bioorg Med Chem Lett19:6670-4 (2009) 
 
Angiopoietin-1 receptor
Name:Angiopoietin-1 receptor
Type:Enzyme
Mol. Mass.:125835.70
Organism:Homo sapiens (Human)
Description:Q02763
Residue:1124
BDBM50311967
NameBDBM50311967
Synonyms:6-(1-methyl-4-phenyl-1H-imidazol-5-yl)thieno[2,3-d]pyrimidin-4-amine | CHEMBL1079428
TypeSmall organic molecule
Emp. Form.C16H13N5S
Mol. Mass.307.373
SMILESCn1cnc(c1-c1cc2c(N)ncnc2s1)-c1ccccc1