Reaction Details
TargetSerine/threonine-protein kinase B-raf
LigandBDBM50026010
Substrate/Competitorn/a
Meas. Tech.ChEMBL_620206 (CHEMBL1115841)
IC50<0.320000±n/a nM
Citation Wang, XBerger, DMSalaski, EJTorres, NHu, YLevin, JIPowell, DWojciechowicz, DCollins, KFrommer, E Discovery of highly potent and selective type I B-Raf kinase inhibitors. Bioorg Med Chem Lett19:6571-4 (2009) 
 
Serine/threonine-protein kinase B-raf
Name:Serine/threonine-protein kinase B-raf
Type:Serine/threonine-protein kinase
Mol. Mass.:84446.00
Organism:Homo sapiens (Human)
Description:P15056
Residue:766
BDBM50026010
NameBDBM50026010
Synonyms:CHEMBL1087013
TypeSmall organic molecule
Emp. Form.C29H25FN6O
Mol. Mass.492.5468
SMILES[H][C@]12CN(c3ccc(c(F)c3)-c3ccnc4c(c(nn34)-c3ccncc3)-c3cccc(O)c3)[C@]([H])(CN1C)C2