Reaction Details
TargetSerine/threonine-protein kinase B-raf
LigandBDBM50025938
Substrate/Competitorn/a
Meas. Tech.ChEMBL_620206 (CHEMBL1115841)
IC50<0.320000±n/a nM
Citation Wang, XBerger, DMSalaski, EJTorres, NHu, YLevin, JIPowell, DWojciechowicz, DCollins, KFrommer, E Discovery of highly potent and selective type I B-Raf kinase inhibitors. Bioorg Med Chem Lett19:6571-4 (2009) 
 
Serine/threonine-protein kinase B-raf
Name:Serine/threonine-protein kinase B-raf
Type:Serine/threonine-protein kinase
Mol. Mass.:84446.00
Organism:Homo sapiens (Human)
Description:P15056
Residue:766
BDBM50025938
NameBDBM50025938
Synonyms:CHEMBL1088439
TypeSmall organic molecule
Emp. Form.C28H23FN6O
Mol. Mass.478.5202
SMILES[H][C@]12CN(c3ccc(cc3)-c3ccnc4c(c(nn34)-c3ccncc3)-c3ccc(F)c(O)c3)[C@]([H])(CN1)C2