Reaction Details
TargetSerine/threonine-protein kinase B-raf
LigandBDBM50311978
Substrate/Competitorn/a
Meas. Tech.ChEMBL_620206 (CHEMBL1115841)
IC50 0.900000±n/a nM
Citation Wang, XBerger, DMSalaski, EJTorres, NHu, YLevin, JIPowell, DWojciechowicz, DCollins, KFrommer, E Discovery of highly potent and selective type I B-Raf kinase inhibitors. Bioorg Med Chem Lett19:6571-4 (2009) 
 
Serine/threonine-protein kinase B-raf
Name:Serine/threonine-protein kinase B-raf
Type:Serine/threonine-protein kinase
Mol. Mass.:84446.00
Organism:Homo sapiens (Human)
Description:P15056
Residue:766
BDBM50311978
NameBDBM50311978
Synonyms:3-(3-hydroxyphenyl)-2-(pyridin-4-yl)pyrazolo[1,5-a]pyrimidine | CHEMBL1080476
TypeSmall organic molecule
Emp. Form.C30H28N6O
Mol. Mass.488.5829
SMILESCN1C2CCC1CN(C2)c1ccc(cc1)-c1ccnc2c(c(nn12)-c1ccncc1)-c1cccc(O)c1