Reaction Details
TargetSerine/threonine-protein kinase B-raf
LigandBDBM50311980
Substrate/Competitorn/a
Meas. Tech.ChEMBL_620206 (CHEMBL1115841)
IC50 9.7±n/a nM
Citation Wang, XBerger, DMSalaski, EJTorres, NHu, YLevin, JIPowell, DWojciechowicz, DCollins, KFrommer, E Discovery of highly potent and selective type I B-Raf kinase inhibitors. Bioorg Med Chem Lett19:6571-4 (2009) 
 
Serine/threonine-protein kinase B-raf
Name:Serine/threonine-protein kinase B-raf
Type:Serine/threonine-protein kinase
Mol. Mass.:84446.00
Organism:Homo sapiens (Human)
Description:P15056
Residue:766
BDBM50311980
NameBDBM50311980
Synonyms:3-(4-chloro-3-methoxyphenyl)-7-(4-(8-methyl-3,8-diazabicyclo[3.2.1]octan-3-yl)phenyl)-2-(pyridin-4-yl)pyrazolo[1,5-a]pyrimidine | CHEMBL1088288
TypeSmall organic molecule
Emp. Form.C31H29ClN6O
Mol. Mass.537.055
SMILESCOc1cc(ccc1Cl)-c1c(nn2c(ccnc12)-c1ccc(cc1)N1CC2CCC(C1)N2C)-c1ccncc1