Reaction Details
TargetSerine/threonine-protein kinase B-raf
LigandBDBM50311991
Substrate/Competitorn/a
Meas. Tech.ChEMBL_620206 (CHEMBL1115841)
IC50 8.2±n/a nM
Citation Wang, XBerger, DMSalaski, EJTorres, NHu, YLevin, JIPowell, DWojciechowicz, DCollins, KFrommer, E Discovery of highly potent and selective type I B-Raf kinase inhibitors. Bioorg Med Chem Lett19:6571-4 (2009) 
 
Serine/threonine-protein kinase B-raf
Name:Serine/threonine-protein kinase B-raf
Type:Serine/threonine-protein kinase
Mol. Mass.:84446.00
Organism:Homo sapiens (Human)
Description:P15056
Residue:766
BDBM50311991
NameBDBM50311991
Synonyms:3-(3-methoxyphenyl)-7-(4-((1S,4S)-5-methyl-2,5-diazabicyclo[2.2.1]heptan-2-yl)phenyl)-2-(pyridin-4-yl)pyrazolo[1,5-a]pyrimidine | CHEMBL1080615
TypeSmall organic molecule
Emp. Form.C30H28N6O
Mol. Mass.488.5829
SMILESCOc1cccc(c1)-c1c(nn2c(ccnc12)-c1ccc(cc1)N1C[C@@H]2C[C@H]1CN2C)-c1ccncc1