Reaction Details
TargetAngiopoietin-1 receptor
LigandBDBM50312156
Substrate/Competitorn/a
Meas. Tech.ChEMBL_621348 (CHEMBL1109441)
IC50 37±n/a nM
Citation Mitchell, SADanca, MDBlomgren, PADarrow, JWCurrie, KSKropf, JELee, SHGallion, SLXiong, JMPippin, DADeSimone, RWBrittelli, DREustice, DCBourret, AHill-Drzewi, MMaciejewski, PMElkin, LL Imidazo[1,2-a]pyrazine diaryl ureas: inhibitors of the receptor tyrosine kinase EphB4. Bioorg Med Chem Lett19:6991-5 (2009) 
 
Angiopoietin-1 receptor
Name:Angiopoietin-1 receptor
Type:Enzyme
Mol. Mass.:125835.70
Organism:Homo sapiens (Human)
Description:Q02763
Residue:1124
BDBM50312156
NameBDBM50312156
Synonyms:1-(2-fluoro-5-(trifluoromethyl)phenyl)-3-(3-(8-(pyridin-4-ylmethylamino)imidazo[1,2-a]pyrazin-6-yl)phenyl)urea | CHEMBL1079850
TypeSmall organic molecule
Emp. Form.C26H19F4N7O
Mol. Mass.521.469
SMILESFc1ccc(cc1NC(=O)Nc1cccc(c1)-c1cn2ccnc2c(NCc2ccncc2)n1)C(F)(F)F