Reaction Details
TargetEphrin type-B receptor 4
LigandBDBM50312158
Substrate/Competitorn/a
Meas. Tech.ChEMBL_621633 (CHEMBL1115704)
IC50 5400±n/a nM
Citation Mitchell, SADanca, MDBlomgren, PADarrow, JWCurrie, KSKropf, JELee, SHGallion, SLXiong, JMPippin, DADeSimone, RWBrittelli, DREustice, DCBourret, AHill-Drzewi, MMaciejewski, PMElkin, LL Imidazo[1,2-a]pyrazine diaryl ureas: inhibitors of the receptor tyrosine kinase EphB4. Bioorg Med Chem Lett19:6991-5 (2009) 
 
Ephrin type-B receptor 4
Name:Ephrin type-B receptor 4
Type:Enzyme
Mol. Mass.:108273.51
Organism:Homo sapiens (Human)
Description:P54760
Residue:987
BDBM50312158
NameBDBM50312158
Synonyms:1-(3-(8-aminoimidazo[1,2-a]pyrazin-6-yl)phenyl)-3-(5-chloro-2-methoxyphenyl)urea | CHEMBL1081222
TypeSmall organic molecule
Emp. Form.C20H17ClN6O2
Mol. Mass.408.841
SMILESCOc1ccc(Cl)cc1NC(=O)Nc1cccc(c1)-c1cn2ccnc2c(N)n1