Reaction Details
TargetEphrin type-B receptor 4
LigandBDBM50312180
Substrate/Competitorn/a
Meas. Tech.ChEMBL_621633 (CHEMBL1115704)
IC50 1800±n/a nM
Citation Mitchell, SADanca, MDBlomgren, PADarrow, JWCurrie, KSKropf, JELee, SHGallion, SLXiong, JMPippin, DADeSimone, RWBrittelli, DREustice, DCBourret, AHill-Drzewi, MMaciejewski, PMElkin, LL Imidazo[1,2-a]pyrazine diaryl ureas: inhibitors of the receptor tyrosine kinase EphB4. Bioorg Med Chem Lett19:6991-5 (2009) 
 
Ephrin type-B receptor 4
Name:Ephrin type-B receptor 4
Type:Enzyme
Mol. Mass.:108273.51
Organism:Homo sapiens (Human)
Description:P54760
Residue:987
BDBM50312180
NameBDBM50312180
Synonyms:1-(3,5-dichlorophenyl)-3-(3-(8-(pyridin-4-ylmethylamino)imidazo[1,2-a]pyrazin-6-yl)phenyl)urea | CHEMBL1081568
TypeSmall organic molecule
Emp. Form.C25H19Cl2N7O
Mol. Mass.504.371
SMILESClc1cc(Cl)cc(NC(=O)Nc2cccc(c2)-c2cn3ccnc3c(NCc3ccncc3)n2)c1