Reaction Details
TargetLow molecular weight protein-tyrosine phosphatase A
LigandBDBM50312228
Substrate/Competitorn/a
Meas. Tech.ChEMBL_621991 (CHEMBL1106782)
Ki>100000±n/a nM
Citation Rawls, KALang, PTTakeuchi, JImamura, SBaguley, TDGrundner, CAlber, TEllman, JA Fragment-based discovery of selective inhibitors of the Mycobacterium tuberculosis protein tyrosine phosphatase PtpA. Bioorg Med Chem Lett19:6851-4 (2009) 
 
Low molecular weight protein-tyrosine phosphatase A
Name:Low molecular weight protein-tyrosine phosphatase A
Type:Hydrolase
Mol. Mass.:17891.84
Organism:Mycobacterium tuberculosis
Description:n/a
Residue:163
BDBM50312228
NameBDBM50312228
Synonyms:CHEMBL1081748 | difluoro(4-(1-methyl-1H-pyrazol-4-yl)phenyl)methylphosphonic acid
TypeSmall organic molecule
Emp. Form.C11H11F2N2O3P
Mol. Mass.288.1872
SMILESCn1cc(cn1)-c1ccc(cc1)C(F)(F)P(O)(O)=O