Reaction Details
TargetLow molecular weight protein-tyrosine phosphatase A
LigandBDBM50312256
Substrate/Competitorn/a
Meas. Tech.ChEMBL_621991 (CHEMBL1106782)
Ki 10300±n/a nM
Citation Rawls, KALang, PTTakeuchi, JImamura, SBaguley, TDGrundner, CAlber, TEllman, JA Fragment-based discovery of selective inhibitors of the Mycobacterium tuberculosis protein tyrosine phosphatase PtpA. Bioorg Med Chem Lett19:6851-4 (2009) 
 
Low molecular weight protein-tyrosine phosphatase A
Name:Low molecular weight protein-tyrosine phosphatase A
Type:Hydrolase
Mol. Mass.:17891.84
Organism:Mycobacterium tuberculosis
Description:n/a
Residue:163
BDBM50312256
NameBDBM50312256
Synonyms:(4-(4-bromophenylcarbamoyl)phenyl)difluoromethylphosphonic acid | CHEMBL1080496
TypeSmall organic molecule
Emp. Form.C14H11BrF2NO4P
Mol. Mass.406.116
SMILESOP(O)(=O)C(F)(F)c1ccc(cc1)C(=O)Nc1ccc(Br)cc1