Reaction Details
TargetLow molecular weight protein-tyrosine phosphatase A
LigandBDBM50312260
Substrate/Competitorn/a
Meas. Tech.ChEMBL_621991 (CHEMBL1106782)
Ki 3300±n/a nM
Citation Rawls, KALang, PTTakeuchi, JImamura, SBaguley, TDGrundner, CAlber, TEllman, JA Fragment-based discovery of selective inhibitors of the Mycobacterium tuberculosis protein tyrosine phosphatase PtpA. Bioorg Med Chem Lett19:6851-4 (2009) 
 
Low molecular weight protein-tyrosine phosphatase A
Name:Low molecular weight protein-tyrosine phosphatase A
Type:Hydrolase
Mol. Mass.:17891.84
Organism:Mycobacterium tuberculosis
Description:n/a
Residue:163
BDBM50312260
NameBDBM50312260
Synonyms:(4-(3,5-bis(trifluoromethyl)phenylcarbamoyl)phenyl)difluoromethylphosphonic acid | CHEMBL1081578
TypeSmall organic molecule
Emp. Form.C16H10F8NO4P
Mol. Mass.463.2159
SMILESOP(O)(=O)C(F)(F)c1ccc(cc1)C(=O)Nc1cc(cc(c1)C(F)(F)F)C(F)(F)F