Reaction Details
TargetReceptor-type tyrosine-protein phosphatase C
LigandBDBM50312261
Substrate/Competitorn/a
Meas. Tech.ChEMBL_621996 (CHEMBL1106787)
Ki>100000±n/a nM
Citation Rawls, KALang, PTTakeuchi, JImamura, SBaguley, TDGrundner, CAlber, TEllman, JA Fragment-based discovery of selective inhibitors of the Mycobacterium tuberculosis protein tyrosine phosphatase PtpA. Bioorg Med Chem Lett19:6851-4 (2009) 
 
Receptor-type tyrosine-protein phosphatase C
Name:Receptor-type tyrosine-protein phosphatase C
Type:Protein
Mol. Mass.:147474.19
Organism:Homo sapiens (Human)
Description:P08575
Residue:1306
BDBM50312261
NameBDBM50312261
Synonyms:(4-(4-bromo-3,5-bis(trifluoromethyl)phenylcarbamoyl)phenyl)difluoromethylphosphonic acid | CHEMBL1081579
TypeSmall organic molecule
Emp. Form.C16H9BrF8NO4P
Mol. Mass.542.112
SMILESOP(O)(=O)C(F)(F)c1ccc(cc1)C(=O)Nc1cc(c(Br)c(c1)C(F)(F)F)C(F)(F)F