Reaction Details
TargetMast/stem cell growth factor receptor Kit
LigandBDBM50207483
Substrate/Competitorn/a
Meas. Tech.ChEMBL_622359 (CHEMBL1114167)
IC50 152±n/a nM
Citation Kansal, NSilakari, ORavikumar, M Three dimensional pharmacophore modelling for c-Kit receptor tyrosine kinase inhibitors. Eur J Med Chem45:393-404 (2010) 
 
Mast/stem cell growth factor receptor Kit
Name:Mast/stem cell growth factor receptor Kit
Type:Protein
Mol. Mass.:109869.37
Organism:Homo sapiens (Human)
Description:P10721
Residue:976
BDBM50207483
NameBDBM50207483
Synonyms:CHEMBL222315 N-[4-(3-amino-1H-indazol-4-yl)-phenyl]-N'-cyclohexylurea
TypeSmall organic molecule
Emp. Form.C20H22N4O
Mol. Mass.334.4149
SMILESNc1n[nH]c2cccc(-c3ccc(NC(=O)C4CCCCC4)cc3)c12