Reaction Details
TargetMast/stem cell growth factor receptor Kit
LigandBDBM50207489
Substrate/Competitorn/a
Meas. Tech.ChEMBL_622359 (CHEMBL1114167)
IC50 34±n/a nM
Citation Kansal, NSilakari, ORavikumar, M Three dimensional pharmacophore modelling for c-Kit receptor tyrosine kinase inhibitors. Eur J Med Chem45:393-404 (2010) 
 
Mast/stem cell growth factor receptor Kit
Name:Mast/stem cell growth factor receptor Kit
Type:Protein
Mol. Mass.:109869.37
Organism:Homo sapiens (Human)
Description:P10721
Residue:976
BDBM50207489
NameBDBM50207489
Synonyms:1-(4-(3-amino-1H-indazol-4-yl)phenyl)-3-(2-fluorophenyl)urea N-[4-(3-amino-1H-indazol-4-yl)phenyl]-N'-(2-fluorophenyl)-urea
TypeSmall organic molecule
Emp. Form.C20H16FN5O
Mol. Mass.361.3723
SMILESNc1n[nH]c2cccc(-c3ccc(NC(=O)Nc4ccccc4F)cc3)c12